BDBM14845 1-(2-Benzyl-5-tert-butyl-2H-pyrazol-3-yl)-3-[4-(2-morpholin-4-yl-ethoxy)-naphthalen-1-yl]-urea::3-(1-benzyl-3-tert-butyl-1H-pyrazol-5-yl)-1-{4-[2-(morpholin-4-yl)ethoxy]naphthalen-1-yl}urea::BIRB-796 Analog 37
SMILES CC(C)(C)c1cc(NC(=O)Nc2ccc(OCCN3CCOCC3)c3ccccc23)n(Cc2ccccc2)n1
InChI Key InChIKey=FIHZNFAKBXOOND-UHFFFAOYSA-N
Data  1 Kd
  Tab Delimited (TSV)   2D SDfile   Computed 3D by Vconf -m prep SDfile
Find this compound or compounds like it in BindingDB:
Activity Spreadsheet -- Enzyme Inhibition Constant Data from BindingDB
Found 1 hit for monomerid = 14845
TargetMitogen-activated protein kinase 14(Mus musculus (mouse))
Boehringer Ingelheim Pharmaceuticals
LigandPNGBDBM14845(1-(2-Benzyl-5-tert-butyl-2H-pyrazol-3-yl)-3-[4-(2-...)
Affinity DataKd:  64nMpH: 7.0 T: 2°C. Assay description: UV thermal melt experiments were carried out in a quartz cuvette loaded with sample containing enzyme and each test compound using a spectrophotomete...
In DepthDetails ArticlePubMed